BDBM50032766 (9aR,11aS)-9a,11a-Dimethyl-7-oxo-2,3,3a,3b,4,5,7,8,9,9a,9b,10,11,11a-tetradecahydro-1H-cyclopenta[i]phenanthridine-1-carboxylic acid benzhydryl-amide::CHEMBL323996
SMILES C[C@]12CCC3C(CN=C4CC(=O)CC[C@]34C)C1CCC2C(=O)NC(c1ccccc1)c1ccccc1
InChI Key InChIKey=BIWFLGLLXFTETL-DLQOBOHJSA-N
Data  2 IC50
  Tab Delimited (TSV)   2D SDfile   Computed 3D by Vconf -m prep SDfile
Find this compound or compounds like it in BindingDB:
Activity Spreadsheet -- Enzyme Inhibition Constant Data from BindingDB
Found 2 hits for monomerid = 50032766
Target3-oxo-5-alpha-steroid 4-dehydrogenase 1(Homo sapiens (Human))
Merck Research Laboratories
Curated by ChEMBL
LigandPNGBDBM50032766((9aR,11aS)-9a,11a-Dimethyl-7-oxo-2,3,3a,3b,4,5,7,8...)
Affinity DataIC50:  186nM. Assay description: Inhibition of type 1 steroid-5-alpha-reductase
In DepthDetails ArticlePubMed
Target3-oxo-5-alpha-steroid 4-dehydrogenase 1(Homo sapiens (Human))
Merck Research Laboratories
Curated by ChEMBL
LigandPNGBDBM50032766((9aR,11aS)-9a,11a-Dimethyl-7-oxo-2,3,3a,3b,4,5,7,8...)
Affinity DataIC50:  186nM. Assay description: Inhibition of recombinant human Steroid 5-alpha-reductase type I
In DepthDetails ArticlePubMed