BDBM50032768 (4aR,6aS)-4a,6a-Dimethyl-2-oxo-2,4a,4b,5,6,6a,7,8,9,9a,9b,10,11,11a-tetradecahydro-1H-indeno[5,4-f]quinoline-7-carboxylic acid (2-amino-phenyl)-amide::CHEMBL108612
SMILES C[C@]12CCC3C(CCC4NC(=O)C=C[C@]34C)C1CCC2C(=O)Nc1ccccc1N
InChI Key InChIKey=BCKQSIZBCMVWRU-JAKPRZHHSA-N
Data  1 IC50
  Tab Delimited (TSV)   2D SDfile   Computed 3D by Vconf -m prep SDfile
Find this compound or compounds like it in BindingDB:
Activity Spreadsheet -- Enzyme Inhibition Constant Data from BindingDB
Found 1 hit for monomerid = 50032768
Target3-oxo-5-alpha-steroid 4-dehydrogenase 1(Homo sapiens (Human))
Merck Research Laboratories
Curated by ChEMBL
LigandPNGBDBM50032768((4aR,6aS)-4a,6a-Dimethyl-2-oxo-2,4a,4b,5,6,6a,7,8,...)
Affinity DataIC50:  130nM. Assay description: Inhibition of recombinant human Steroid 5-alpha-reductase type I
In DepthDetails ArticlePubMed