BDBM50032783 (4aR,6aS)-4a,6a-Dimethyl-2-oxo-2,4a,4b,5,6,6a,7,8,9,9a,9b,10,11,11a-tetradecahydro-1H-indeno[5,4-f]quinoline-7-carboxylic acid m-tolylamide::CHEMBL108151
SMILES Cc1cccc(NC(=O)C2CCC3C4CCC5NC(=O)C=C[C@]5(C)C4CC[C@]23C)c1
InChI Key InChIKey=OEHMLOUHECZJOD-UVEGVAQISA-N
Data  2 IC50
  Tab Delimited (TSV)   2D SDfile   Computed 3D by Vconf -m prep SDfile
Find this compound or compounds like it in BindingDB:
Activity Spreadsheet -- Enzyme Inhibition Constant Data from BindingDB
Found 2 hits for monomerid = 50032783
Target3-oxo-5-alpha-steroid 4-dehydrogenase 2(Homo sapiens (Human))
Merck Research Laboratories
Curated by ChEMBL
LigandPNGBDBM50032783((4aR,6aS)-4a,6a-Dimethyl-2-oxo-2,4a,4b,5,6,6a,7,8,...)
Affinity DataIC50:  0.300nM. Assay description: Inhibition of recombinant human Steroid 5-alpha-reductase type 2
In DepthDetails ArticlePubMed
Target3-oxo-5-alpha-steroid 4-dehydrogenase 1(Homo sapiens (Human))
Merck Research Laboratories
Curated by ChEMBL
LigandPNGBDBM50032783((4aR,6aS)-4a,6a-Dimethyl-2-oxo-2,4a,4b,5,6,6a,7,8,...)
Affinity DataIC50:  25nM. Assay description: Inhibition of recombinant human Steroid 5-alpha-reductase type I
In DepthDetails ArticlePubMed