BDBM50032834 4-[(3-{[((E)-6,6-Dimethyl-hept-2-en-4-ynyl)-ethyl-amino]-methyl}-phenoxymethyl)-dimethyl-silanyl]-benzaldehyde::CHEMBL323953
SMILES CCN(C\C=C\C#CC(C)(C)C)Cc1cccc(OC[Si](C)(C)c2ccc(C=O)cc2)c1
InChI Key InChIKey=YGVVXGLFJQYZKU-CSKARUKUSA-N
Data  1 IC50
  Tab Delimited (TSV)   2D SDfile   Computed 3D by Vconf -m prep SDfile
Find this compound or compounds like it in BindingDB:
Activity Spreadsheet -- Enzyme Inhibition Constant Data from BindingDB
Found 1 hit for monomerid = 50032834
TargetSqualene monooxygenase(Homo sapiens (Human))
Centre De Recherche Pierre Fabre
Curated by ChEMBL
LigandPNGBDBM50032834(4-[(3-{[((E)-6,6-Dimethyl-hept-2-en-4-ynyl)-ethyl-...)
Affinity DataIC50:  100nM. Assay description: In vitro inhibitory activity against pig liver microsomal squalene epoxidase
In DepthDetails ArticlePubMed