BDBM50032840 ((E)-6,6-Dimethyl-hept-2-en-4-ynyl)-ethyl-(3-{[(2-methoxy-phenyl)-dimethyl-silanyl]-methoxy}-benzyl)-amine::CHEMBL111126
SMILES CCN(C\C=C\C#CC(C)(C)C)Cc1cccc(OC[Si](C)(C)c2ccccc2OC)c1
InChI Key InChIKey=QESZUJHFKAOSPJ-UKTHLTGXSA-N
Data  1 IC50
  Tab Delimited (TSV)   2D SDfile   Computed 3D by Vconf -m prep SDfile
Find this compound or compounds like it in BindingDB:
Activity Spreadsheet -- Enzyme Inhibition Constant Data from BindingDB
Found 1 hit for monomerid = 50032840
TargetSqualene monooxygenase(Homo sapiens (Human))
Centre De Recherche Pierre Fabre
Curated by ChEMBL
LigandPNGBDBM50032840(((E)-6,6-Dimethyl-hept-2-en-4-ynyl)-ethyl-(3-{[(2-...)
Affinity DataIC50:  150nM. Assay description: In vitro inhibitory activity against pig liver microsomal squalene epoxidase
In DepthDetails ArticlePubMed