BDBM50032893 CHEMBL3342782
SMILES C[C@H](Nc1nc(Cl)cc(n1)N1[C@H](COC1=O)C1CC1)c1cn(cn1)-c1ccc(F)cc1
InChI Key InChIKey=NVEOHQXXRXOYNO-YVEFUNNKSA-N
Data  2 IC50
  Tab Delimited (TSV)   2D SDfile   Computed 3D by Vconf -m prep SDfile
Find this compound or compounds like it in BindingDB:
Activity Spreadsheet -- Enzyme Inhibition Constant Data from BindingDB
Found 2 hits for monomerid = 50032893
TargetIsocitrate dehydrogenase [NADP] cytoplasmic(Homo sapiens (Human))
Therachem Research Medilab (India)
Curated by ChEMBL
LigandPNGBDBM50032893(CHEMBL3342782)
Affinity DataIC50:  20nM. Assay description: Inhibition of IDH1 R132H mutant (unknown origin) assessed as inhibition of [3C]2-hydroxyglutarate formation after 45 mins by LC-MS biochemical assay
In DepthDetails ArticlePubMed
TargetIsocitrate dehydrogenase [NADP] cytoplasmic(Homo sapiens (Human))
Therachem Research Medilab (India)
Curated by ChEMBL
LigandPNGBDBM50032893(CHEMBL3342782)
Affinity DataIC50:  7.30nM. Assay description: Inhibition of IDH1 R132H mutant (unknown origin) using a-ketoglutarate as substrate by fluorescence biochemical assay
In DepthDetails ArticlePubMed