BDBM50032918 CHEMBL3356140
SMILES COc1cccc(c1)C(=O)Nc1cc2n(C)c(=O)n(C)c2cc1N1CCCCC1
InChI Key InChIKey=NJFGFBPEEDLUSJ-UHFFFAOYSA-N
Data  2 IC50
  Tab Delimited (TSV)   2D SDfile   Computed 3D by Vconf -m prep SDfile
Find this compound or compounds like it in BindingDB:
Activity Spreadsheet -- Enzyme Inhibition Constant Data from BindingDB
Found 2 hits for monomerid = 50032918
TargetPeregrin(Homo sapiens (Human))
Glaxosmithkline
Curated by ChEMBL
LigandPNGBDBM50032918(CHEMBL3356140)
Affinity DataIC50:  100nM. Assay description: Binding affinity to 6H-Flag-tagged Tev-BRPF1 (622-738 aa) (unknown origin) by TR-FRET competitive assay
In DepthDetails ArticlePubMed
TargetBromodomain-containing protein 4(Homo sapiens (Human))
Glaxosmithkline
Curated by ChEMBL
LigandPNGBDBM50032918(CHEMBL3356140)
Affinity DataIC50: <5.01E+4nM. Assay description: Binding affinity to 6His-tagged-BRD4 BD1 Y390A mutant (1 to 477 aa) (unknown origin) by TR-FRET competitive assay
In DepthDetails ArticlePubMed