BDBM50032985 Bis-(3-amino-propyl)-phosphinic acid::CHEMBL112291
SMILES NCCCP(O)(=O)CCCN
InChI Key InChIKey=PFPZWHLJDGSPSV-UHFFFAOYSA-N
Data  1 IC50
  Tab Delimited (TSV)   2D SDfile   Computed 3D by Vconf -m prep SDfile
Find this compound or compounds like it in BindingDB:
Activity Spreadsheet -- Enzyme Inhibition Constant Data from BindingDB
Found 1 hit for monomerid = 50032985
TargetGamma-aminobutyric acid type B receptor subunit 1(Rattus norvegicus (Rat))
Ciba-Geigy
Curated by ChEMBL
LigandPNGBDBM50032985(Bis-(3-amino-propyl)-phosphinic acid | CHEMBL11229...)
Affinity DataIC50:  2.90E+4nM. Assay description: Inhibition of binding of [3H]-CGP-27,492 to gamma-aminobutyric acid type B receptor of rat cortex.
In DepthDetails ArticlePubMed