BDBM50033223 7,8-Dimethyl-4-[4-(2-methyl-imidazo[4,5-c]pyridin-1-yl)-phenyl]-1,3-dihydro-benzo[b][1,4]diazepine-2-thione::CHEMBL434028
SMILES Cc1nc2cnccc2n1-c1ccc(cc1)C1=Nc2cc(C)c(C)cc2NC(=S)C1
InChI Key InChIKey=IHEKHWWUUMNZCX-UHFFFAOYSA-N
Data  1 IC50
  Tab Delimited (TSV)   2D SDfile   Computed 3D by Vconf -m prep SDfile
Find this compound or compounds like it in BindingDB:
Activity Spreadsheet -- Enzyme Inhibition Constant Data from BindingDB
Found 1 hit for monomerid = 50033223
TargetPlatelet-activating factor receptor(Cavia porcellus)
Pfizer
Curated by ChEMBL
LigandPNGBDBM50033223(7,8-Dimethyl-4-[4-(2-methyl-imidazo[4,5-c]pyridin-...)
Affinity DataIC50:  0.600nM. Assay description: Antagonistic activity was tested against Platelet-Activating Factor-induced aggregation of rabbit washed platelets.
In DepthDetails ArticlePubMed