BDBM50033348 CHEMBL554946::Cyclohexylmethyl-(2-imidazol-1-yl-quinazolin-4-yl)-amine; dihydrochloride
SMILES C(Nc1nc(nc2ccccc12)-n1ccnc1)C1CCCCC1
InChI Key InChIKey=HAXOZTLJXUGADD-UHFFFAOYSA-N
Data  1 IC50
  Tab Delimited (TSV)   2D SDfile   Computed 3D by Vconf -m prep SDfile
Find this compound or compounds like it in BindingDB:
Activity Spreadsheet -- Enzyme Inhibition Constant Data from BindingDB
Found 1 hit for monomerid = 50033348
TargetcGMP-specific 3',5'-cyclic phosphodiesterase(Homo sapiens (Human))
Biofor
Curated by ChEMBL
LigandPNGBDBM50033348(CHEMBL554946 | Cyclohexylmethyl-(2-imidazol-1-yl-q...)
Affinity DataIC50:  230nM. Assay description: Inhibitory activity against phosphodiesterase 5 from human platelets
In DepthDetails ArticlePubMed