BDBM50033722 (R)-1-(5,8-dihydroxy-1,4-dioxo-1,4-dihydronaphthalen-2-yl)-4-methylpent-3-enyl isobutyrate::CHEMBL9416::ISOBUTYLSHIKONIN::Isobutyric acid (R)-1-(5,8-dihydroxy-1,4-dioxo-1,4-dihydro-naphthalen-2-yl)-4-methyl-pent-3-enyl ester
SMILES [#6]-[#6](-[#6])-[#6](=O)-[#8]-[#6](=[#6]\[#6]=[#6](\[#6])-[#6])-c1cc(-[#8])c2c(-[#8])ccc(-[#8])c2c1-[#8]
InChI Key InChIKey=CVESWGQNHXEYIQ-UHFFFAOYSA-N
Data  3 IC50
  Tab Delimited (TSV)   2D SDfile   Computed 3D by Vconf -m prep SDfile
Find this compound or compounds like it in BindingDB:
Activity Spreadsheet -- Enzyme Inhibition Constant Data from BindingDB
Found 3 hits for monomerid = 50033722
TargetDNA topoisomerase 1(Homo sapiens (Human))
Chungnam National University
Curated by ChEMBL
LigandPNGBDBM50033722((R)-1-(5,8-dihydroxy-1,4-dioxo-1,4-dihydronaphthal...)
Affinity DataIC50:  8.40E+4nM. Assay description: Inhibitory activity against DNA topoisomerase-I obtained from Hela cells
In DepthDetails ArticlePubMed
TargetNeuraminidase(Influenza A virus (strain A/Brevig Mission/1/1918 ...)
Korea Research Institute Of Bioscience And Biotechnology
Curated by ChEMBL
LigandPNGBDBM50033722((R)-1-(5,8-dihydroxy-1,4-dioxo-1,4-dihydronaphthal...)
Affinity DataIC50:  4.05E+4nM. Assay description: Inhibition of recombinant influenza A virus H1N1 A/Bervig_Mission/1/18 sialidase activity using 4-methylumbelliferyl-alpha-D-N-acetylneuraminic acid ...
In DepthDetails ArticlePubMed
TargetSterol O-acyltransferase 2(Homo sapiens (Human))
National Research Laboratory Of Lipid Metabolism And Atherosclerosis
Curated by ChEMBL
LigandPNGBDBM50033722((R)-1-(5,8-dihydroxy-1,4-dioxo-1,4-dihydronaphthal...)
Affinity DataIC50:  5.75E+4nM. Assay description: Inhibition of human ACAT2 expressed in Hi5 cells
In DepthDetails ArticlePubMed