BDBM50033879 CHEMBL3358171
SMILES Cc1cc(C)cc(c1)S(=O)(=O)c1c([nH]c2ccc(Cl)cc12)C(=O)NCc1cccs1
InChI Key InChIKey=JRTBBYIREZFTKB-UHFFFAOYSA-N
Data  4 IC50
  Tab Delimited (TSV)   2D SDfile   Computed 3D by Vconf -m prep SDfile
Find this compound or compounds like it in BindingDB:
Activity Spreadsheet -- Enzyme Inhibition Constant Data from BindingDB
Found 4 hits for monomerid = 50033879
TargetReverse transcriptase(Human immunodeficiency virus 1)
Sapienza University Of Rome
Curated by ChEMBL
LigandPNGBDBM50033879(CHEMBL3358171)
Affinity DataIC50:  30nM. Assay description: Inhibition of wild type HIV1 reverse transcriptase assessed as reduction in enzyme activity
In DepthDetails ArticlePubMed
TargetReverse transcriptase(Human immunodeficiency virus 1)
Sapienza University Of Rome
Curated by ChEMBL
LigandPNGBDBM50033879(CHEMBL3358171)
Affinity DataIC50: >2.00E+4nM. Assay description: Inhibition of wild type HIV1 reverse transcriptase Y181I mutant assessed as reduction in enzyme activity
In DepthDetails ArticlePubMed
TargetReverse transcriptase(Human immunodeficiency virus 1)
Sapienza University Of Rome
Curated by ChEMBL
LigandPNGBDBM50033879(CHEMBL3358171)
Affinity DataIC50:  100nM. Assay description: Inhibition of wild type HIV1 reverse transcriptase L100I mutant assessed as reduction in enzyme activity
In DepthDetails ArticlePubMed
TargetReverse transcriptase(Human immunodeficiency virus 1)
Sapienza University Of Rome
Curated by ChEMBL
LigandPNGBDBM50033879(CHEMBL3358171)
Affinity DataIC50: >2.00E+4nM. Assay description: Inhibition of wild type HIV1 reverse transcriptase K103N mutant assessed as reduction in enzyme activity
In DepthDetails ArticlePubMed