BDBM50034044 1-(4-{4-[4-(6-Chloro-benzo[d]isoxazol-3-yl)-piperidin-1-yl]-butoxy}-3-methoxy-phenyl)-ethanone::CHEMBL14206
SMILES COc1cc(ccc1OCCCCN1CCC(CC1)c1noc2cc(Cl)ccc12)C(C)=O
InChI Key InChIKey=YZFVRDOVVWXHEO-UHFFFAOYSA-N
Data  1 IC50
  Tab Delimited (TSV)   2D SDfile   Computed 3D by Vconf -m prep SDfile
Find this compound or compounds like it in BindingDB:
Activity Spreadsheet -- Enzyme Inhibition Constant Data from BindingDB
Found 1 hit for monomerid = 50034044
TargetD(2) dopamine receptor(Rattus norvegicus (rat))
Hoechst-Roussel Pharmaceuticals
Curated by ChEMBL
LigandPNGBDBM50034044(1-(4-{4-[4-(6-Chloro-benzo[d]isoxazol-3-yl)-piperi...)
Affinity DataIC50:  110nM. Assay description: Affinity for dopamine receptor D2 binding sites by its ability to displace [3H]spiperone from rat striatum.
In DepthDetails ArticlePubMed