BDBM50034322 (3aS,9bS)-3-Allyl-9-methoxy-2,3,3a,4,5,9b-hexahydro-1H-benzo[e]indole::CHEMBL279207
SMILES COc1cccc2CC[C@H]3[C@@H](CCN3CC=C)c12
InChI Key InChIKey=VRRJFCMGNMFNOE-KGLIPLIRSA-N
Data  1 KI
  Tab Delimited (TSV)   2D SDfile   Computed 3D by Vconf -m prep SDfile
Find this compound or compounds like it in BindingDB:
Activity Spreadsheet -- Enzyme Inhibition Constant Data from BindingDB
Found 1 hit for monomerid = 50034322
Target5-hydroxytryptamine receptor 1A(Homo sapiens (Human))
Arris Pharmaceutical
Curated by ChEMBL
LigandPNGBDBM50034322((3aS,9bS)-3-Allyl-9-methoxy-2,3,3a,4,5,9b-hexahydr...)
Affinity DataKi:  0.200nM. Assay description: Tested for activity against 5-hydroxytryptamine 1A receptor from bovine hippocampus
In DepthDetails ArticlePubMed