BDBM50035224 CHEMBL3343347
SMILES CC(C)n1n(C(C)=O)c2ccccc2c1=O
InChI Key InChIKey=ZIDNNAXSJQORRR-UHFFFAOYSA-N
Data  1 IC50
  Tab Delimited (TSV)   2D SDfile   Computed 3D by Vconf -m prep SDfile
Find this compound or compounds like it in BindingDB:
Activity Spreadsheet -- Enzyme Inhibition Constant Data from BindingDB
Found 1 hit for monomerid = 50035224
TargetMyeloperoxidase(Homo sapiens (Human))
University Of California
Curated by ChEMBL
LigandPNGBDBM50035224(CHEMBL3343347)
Affinity DataIC50: >1.00E+4nM. Assay description: Inhibition of myeloperoxidase (unknown origin) assessed as reduction in enzymatic hypochlorous acid production by spectrophotometry based taurine chl...
In DepthDetails ArticlePubMed