BDBM50035328 (R)-8-Dipropylamino-6,7,8,9-tetrahydro-3H-benzo[e]indole-1-carbonitrile::CHEMBL308347
SMILES CCCN(CCC)[C@@H]1CCc2ccc3[nH]cc(C#N)c3c2C1
InChI Key InChIKey=ODCNQSRYNGLVNW-MRXNPFEDSA-N
Data  7 KI
  Tab Delimited (TSV)   2D SDfile   Computed 3D by Vconf -m prep SDfile
Find this compound or compounds like it in BindingDB:
Activity Spreadsheet -- Enzyme Inhibition Constant Data from BindingDB
Found 7 hits for monomerid = 50035328
Target5-hydroxytryptamine receptor 1A(Rattus norvegicus (rat))
GöTeborg University
Curated by ChEMBL
LigandPNGBDBM50035328((R)-8-Dipropylamino-6,7,8,9-tetrahydro-3H-benzo[e]...)
Affinity DataKi:  0.800nM. Assay description: Binding affinity against 5-hydroxytryptamine 1A receptor from CHO-K1 cells, using [3H]-8-OH-DPAT as the radioligand.
In DepthDetails ArticlePubMed
Target5-hydroxytryptamine receptor 1A(Rattus norvegicus (rat))
GöTeborg University
Curated by ChEMBL
LigandPNGBDBM50035328((R)-8-Dipropylamino-6,7,8,9-tetrahydro-3H-benzo[e]...)
Affinity DataKi:  2.70nM. Assay description: Displacement of the radioligand [3H]-8-OH-DPAT from 5-hydroxytryptamine 1A receptor
In DepthDetails ArticlePubMed
Target5-hydroxytryptamine receptor 1D(Homo sapiens (Human))
GöTeborg University
Curated by ChEMBL
LigandPNGBDBM50035328((R)-8-Dipropylamino-6,7,8,9-tetrahydro-3H-benzo[e]...)
Affinity DataKi:  6.70nM. Assay description: Binding affinity against 5-hydroxytryptamine 1D receptor alpha expressed in CHO-K1 cells, using [3H]-5-HT as the radioligand.
In DepthDetails ArticlePubMed
TargetD(2) dopamine receptor(Rattus norvegicus (rat))
GöTeborg University
Curated by ChEMBL
LigandPNGBDBM50035328((R)-8-Dipropylamino-6,7,8,9-tetrahydro-3H-benzo[e]...)
Affinity DataKi:  22nM. Assay description: Binding affinity against Dopamine receptor D2 expressed in CHO-K1 cells, using [3H]-U-86,170 as the radioligand.
In DepthDetails ArticlePubMed
Target5-hydroxytryptamine receptor 1B(Homo sapiens (Human))
GöTeborg University
Curated by ChEMBL
LigandPNGBDBM50035328((R)-8-Dipropylamino-6,7,8,9-tetrahydro-3H-benzo[e]...)
Affinity DataKi:  26nM. Assay description: Binding affinity against 5-hydroxytryptamine 1D receptor beta expressed in CHO-K1 cells, using [3H]-5-HT as the radioligand.
In DepthDetails ArticlePubMed
TargetD(3) dopamine receptor(Rattus norvegicus (Rat))
GöTeborg University
Curated by ChEMBL
LigandPNGBDBM50035328((R)-8-Dipropylamino-6,7,8,9-tetrahydro-3H-benzo[e]...)
Affinity DataKi:  45nM. Assay description: Binding affinity against Dopamine receptor D3 expressed in CHO-K1 cells, using [3H]-spiperone as the radioligand.
In DepthDetails ArticlePubMed
TargetD(2) dopamine receptor(Rattus norvegicus (rat))
GöTeborg University
Curated by ChEMBL
LigandPNGBDBM50035328((R)-8-Dipropylamino-6,7,8,9-tetrahydro-3H-benzo[e]...)
Affinity DataKi:  419nM. Assay description: Displacement of the radioligand [3H]-spiperone from D2 receptor
In DepthDetails ArticlePubMed