BDBM50035373 7-Chloro-2-(4-methoxy-phenyl)-3,5-dihydro-2H-pyrazolo[3,4-c]quinoline-1,4-dione::CHEMBL72802
SMILES COc1ccc(cc1)-n1[nH]c2c(c3ccc(Cl)cc3[nH]c2=O)c1=O
InChI Key InChIKey=LFERNUMYBHHXAK-UHFFFAOYSA-N
Data  1 IC50
  Tab Delimited (TSV)   2D SDfile   Computed 3D by Vconf -m prep SDfile
Find this compound or compounds like it in BindingDB:
Activity Spreadsheet -- Enzyme Inhibition Constant Data from BindingDB
Found 1 hit for monomerid = 50035373
TargetGlutamate receptor ionotropic, NMDA 1(RAT)
Merck Sharp And Dohme Research Laboratories
Curated by ChEMBL
LigandPNGBDBM50035373(7-Chloro-2-(4-methoxy-phenyl)-3,5-dihydro-2H-pyraz...)
Affinity DataIC50:  3.30nM. Assay description: Inhibition of [3H]-3 binding to the glycine site on the NMDA receptor in Rat cortical slices
In DepthDetails ArticlePubMed