BDBM50035512 CHEMBL140697::N-{2-[4-(2-Methoxy-phenyl)-piperazin-1-yl]-ethyl}-4-methyl-N-pyridin-2-yl-benzamide
SMILES COc1ccccc1N1CCN(CCN(C(=O)c2ccc(C)cc2)c2ccccn2)CC1
InChI Key InChIKey=IFXNLSMJXGZVMR-UHFFFAOYSA-N
Data  1 KI
  Tab Delimited (TSV)   2D SDfile   Computed 3D by Vconf -m prep SDfile
Find this compound or compounds like it in BindingDB:
Activity Spreadsheet -- Enzyme Inhibition Constant Data from BindingDB
Found 1 hit for monomerid = 50035512
Target5-hydroxytryptamine receptor 1A(Rattus norvegicus (rat))
University Of Pennsylvania
Curated by ChEMBL
LigandPNGBDBM50035512(CHEMBL140697 | N-{2-[4-(2-Methoxy-phenyl)-piperazi...)
Affinity DataKi:  2.20nM. Assay description: In vitro binding affinity to 5-hydroxytryptamine 1A receptor in rat hippocampal homogenate by [125I](R)-(+)-trans-8-OH-PIPAT displacement.
In DepthDetails ArticlePubMed