BDBM50035618 CHEMBL3338447
SMILES COc1ccc(COc2nc(OCc3ccccn3)ncc2C(=O)c2cc(OC)c(OC)c(OC)c2)cc1Cl
InChI Key InChIKey=SDIMDWARQLNMCM-UHFFFAOYSA-N
Data  1 IC50
  Tab Delimited (TSV)   2D SDfile   Computed 3D by Vconf -m prep SDfile
Find this compound or compounds like it in BindingDB:
Activity Spreadsheet -- Enzyme Inhibition Constant Data from BindingDB
Found 1 hit for monomerid = 50035618
TargetcGMP-specific 3',5'-cyclic phosphodiesterase(Canis lupus familiaris)
Mitsubishi Tanabe Pharma
Curated by ChEMBL
LigandPNGBDBM50035618(CHEMBL3338447)
Affinity DataIC50:  1.5nM. Assay description: Inhibition of canine lung PDE5 using [3H]cGMP substrate by radiolabeled nucleotide method
In DepthDetails ArticlePubMed