BDBM50035822 Ac-Trp-L-3-MPc(Me)-Asp-Phe-NH2::CHEMBL37983
SMILES CS[C@H]1CCN([C@H]1C(=O)N[C@@H](CC(O)=O)C(=O)N[C@@H](Cc1ccccc1)C(N)=O)C(=O)[C@H](Cc1c[nH]c2ccccc12)NC(C)=O
InChI Key InChIKey=ILPFXXPKWUDSBN-LFGITCQGSA-N
Data  2 IC50
  Tab Delimited (TSV)   2D SDfile   Computed 3D by Vconf -m prep SDfile
Find this compound or compounds like it in BindingDB:
Activity Spreadsheet -- Enzyme Inhibition Constant Data from BindingDB
Found 2 hits for monomerid = 50035822
TargetCholecystokinin receptor type A(RAT)
Washington University
Curated by ChEMBL
LigandPNGBDBM50035822(Ac-Trp-L-3-MPc(Me)-Asp-Phe-NH2 | CHEMBL37983)
Affinity DataIC50:  1.00E+4nM. Assay description: Binding affinity towards Cholecystokinin type A receptor by displacement of [125I]-BH-CCK-8 from rat pancreatic acini
In DepthDetails ArticlePubMed
TargetGastrin/cholecystokinin type B receptor(Homo sapiens (Human))
Washington University
Curated by ChEMBL
LigandPNGBDBM50035822(Ac-Trp-L-3-MPc(Me)-Asp-Phe-NH2 | CHEMBL37983)
Affinity DataIC50:  300nM. Assay description: Binding affinity towards Cholecystokinin type B receptor by displacement of [125I]-BH-CCK-8 from human jurkat cells
In DepthDetails ArticlePubMed