BDBM50036165 3-Thiophen-3-yl-1-aza-bicyclo[2.2.2]oct-2-ene::CHEMBL356321
SMILES C1CN2CCC1C(=C2)c1ccsc1
InChI Key InChIKey=TYGNZZAKNRSQMM-UHFFFAOYSA-N
Data  3 KI
  Tab Delimited (TSV)   2D SDfile   Computed 3D by Vconf -m prep SDfile
Find this compound or compounds like it in BindingDB:
Activity Spreadsheet -- Enzyme Inhibition Constant Data from BindingDB
Found 3 hits for monomerid = 50036165
TargetMuscarinic acetylcholine receptor M1(Homo sapiens (Human))
Uppsala University
Curated by ChEMBL
LigandPNGBDBM50036165(3-Thiophen-3-yl-1-aza-bicyclo[2.2.2]oct-2-ene | CH...)
Affinity DataKi:  710nM. Assay description: Binding affinity for muscarinic acetylcholine receptor M1 by measuring displacement of [3H]-QNB from guinea pig cerebral cortex
In DepthDetails ArticlePubMed
TargetMuscarinic acetylcholine receptor M2(Homo sapiens (Human))
Uppsala University
Curated by ChEMBL
LigandPNGBDBM50036165(3-Thiophen-3-yl-1-aza-bicyclo[2.2.2]oct-2-ene | CH...)
Affinity DataKi:  1.70E+3nM. Assay description: Binding affinity for muscarinic acetylcholine receptor M2 by measuring displacement of [3H]-QNB from guinea pig heart
In DepthDetails ArticlePubMed
TargetMuscarinic acetylcholine receptor(Cavia porcellus)
Uppsala University
Curated by ChEMBL
LigandPNGBDBM50036165(3-Thiophen-3-yl-1-aza-bicyclo[2.2.2]oct-2-ene | CH...)
Affinity DataKi:  2.60E+3nM. Assay description: Binding affinity for muscarinic acetylcholine receptor M3 by measuring displacement of [3H]-QNB from guinea pig parotid gland
In DepthDetails ArticlePubMed