BDBM50036218 3-Carboxy-3-mercapto-pentanedioic acid::CHEMBL151277
SMILES OC(=O)CC(S)(CC(O)=O)C(O)=O
InChI Key InChIKey=ZVEOFBJYVXCOEQ-UHFFFAOYSA-N
Data  1 KI
  Tab Delimited (TSV)   2D SDfile   Computed 3D by Vconf -m prep SDfile
Find this compound or compounds like it in BindingDB:
Activity Spreadsheet -- Enzyme Inhibition Constant Data from BindingDB
Found 1 hit for monomerid = 50036218
TargetATP-citrate synthase(Rattus norvegicus)
Smithkline Beecham Pharmaceuticals
Curated by ChEMBL
LigandPNGBDBM50036218(3-Carboxy-3-mercapto-pentanedioic acid | CHEMBL151...)
Affinity DataKi:  2.95E+5nM. Assay description: Reversible binding potential for rat ATP-Citrate Lyase as carbon-carbon bond cleavage activity in citrate substrate
In DepthDetails ArticlePubMed