BDBM50036597 CHEMBL3354263
SMILES CN1C(=N)N[C@](CCC2CCCCC2)(C[C@H]2CCC[C@H](C2)NC(=O)Nc2cnc3ccccc3n2)C1=O
InChI Key InChIKey=BSTJKDBFPPBIRR-BALWLHIASA-N
Data  2 KI
  Tab Delimited (TSV)   2D SDfile   Computed 3D by Vconf -m prep SDfile
Find this compound or compounds like it in BindingDB:
Activity Spreadsheet -- Enzyme Inhibition Constant Data from BindingDB
Found 2 hits for monomerid = 50036597
TargetBeta-secretase 1(Homo sapiens (Human))
Merck Research Laboratories
Curated by ChEMBL
LigandPNGBDBM50036597(CHEMBL3354263)
Affinity DataKi:  14nM. Assay description: Inhibition of purified human BACE1 by FRET assay
In DepthDetails ArticlePubMed
TargetCathepsin D(Homo sapiens (Human))
Merck Research Laboratories
Curated by ChEMBL
LigandPNGBDBM50036597(CHEMBL3354263)
Affinity DataKi:  7.50E+3nM. Assay description: Inhibition of cathepsin-D (unknown origin)
In DepthDetails ArticlePubMed