BDBM50036606 CHEMBL3354259
SMILES COc1ccc(NC(=O)N[C@@H]2CCC[C@H](C[C@@]3(CCC4CCCCC4)NC(=N)N(C)C3=O)C2)cc1
InChI Key InChIKey=HVQGZWAEQHLJJJ-ZVUIFXONSA-N
Data  2 KI
  Tab Delimited (TSV)   2D SDfile   Computed 3D by Vconf -m prep SDfile
Find this compound or compounds like it in BindingDB:
Activity Spreadsheet -- Enzyme Inhibition Constant Data from BindingDB
Found 2 hits for monomerid = 50036606
TargetBeta-secretase 1(Homo sapiens (Human))
Merck Research Laboratories
Curated by ChEMBL
LigandPNGBDBM50036606(CHEMBL3354259)
Affinity DataKi:  10nM. Assay description: Inhibition of purified human BACE1 by FRET assay
In DepthDetails ArticlePubMed
TargetCathepsin D(Homo sapiens (Human))
Merck Research Laboratories
Curated by ChEMBL
LigandPNGBDBM50036606(CHEMBL3354259)
Affinity DataKi:  2.50E+3nM. Assay description: Inhibition of cathepsin-D (unknown origin)
In DepthDetails ArticlePubMed