BDBM50036619 CHEMBL3354273
SMILES COc1ccc(CNc2nc(OCc3ccccn3)ncc2C(=O)N[C@H]2CC[C@H](O)CC2)cc1Cl
InChI Key InChIKey=NXJJDPAUDJRDIQ-UAPYVXQJSA-N
Data  1 IC50
  Tab Delimited (TSV)   2D SDfile   Computed 3D by Vconf -m prep SDfile
Find this compound or compounds like it in BindingDB:
Activity Spreadsheet -- Enzyme Inhibition Constant Data from BindingDB
Found 1 hit for monomerid = 50036619
TargetcGMP-specific 3',5'-cyclic phosphodiesterase(Canis lupus familiaris)
Mitsubishi Tanabe Pharma
Curated by ChEMBL
LigandPNGBDBM50036619(CHEMBL3354273)
Affinity DataIC50:  3.5nM. Assay description: Inhibition of dog lungs PDE5 using [3H]cGMP as substrate after 30 mins by scintillation counting analysis
In DepthDetails ArticlePubMed