BDBM50036633 CHEMBL3354285
SMILES CO[C@H]1CC[C@@H](CC1)NC(=O)c1cnc(nc1NCc1ccc(OC)c(Cl)c1)N1CCC[C@H]1CO
InChI Key InChIKey=UBWIPQLTJURLSV-FHWLQOOXSA-N
Data  1 IC50
  Tab Delimited (TSV)   2D SDfile   Computed 3D by Vconf -m prep SDfile
Find this compound or compounds like it in BindingDB:
Activity Spreadsheet -- Enzyme Inhibition Constant Data from BindingDB
Found 1 hit for monomerid = 50036633
TargetcGMP-specific 3',5'-cyclic phosphodiesterase(Canis lupus familiaris)
Mitsubishi Tanabe Pharma
Curated by ChEMBL
LigandPNGBDBM50036633(CHEMBL3354285)
Affinity DataIC50:  0.900nM. Assay description: Inhibition of dog lungs PDE5 using [3H]cGMP as substrate after 30 mins by scintillation counting analysis
In DepthDetails ArticlePubMed