BDBM50036843 Acetaldehyde O-(2-hydroxy-3-isopropylamino-propyl)-oxime; compound with (E)-but-2-enedioic acid::CHEMBL290153
SMILES C\C=N\OCC(O)CNC(C)C
InChI Key InChIKey=XPAWJQUCISBPJW-ONNFQVAWSA-N
Data  2 KI  2 IC50
  Tab Delimited (TSV)   2D SDfile   Computed 3D by Vconf -m prep SDfile
Find this compound or compounds like it in BindingDB:
Activity Spreadsheet -- Enzyme Inhibition Constant Data from BindingDB
Found 4 hits for monomerid = 50036843
TargetBeta-1 adrenergic receptor(Rattus norvegicus (Rat))
Universitá
Curated by ChEMBL
LigandPNGBDBM50036843(Acetaldehyde O-(2-hydroxy-3-isopropylamino-propyl)...)
Affinity DataKi:  1.48E+3nM. Assay description: Binding affinity against beta1-adrenergic receptor in rat brain
In DepthDetails ArticlePubMed
TargetBeta-2 adrenergic receptor(BOVINE)
Universitá
Curated by ChEMBL
LigandPNGBDBM50036843(Acetaldehyde O-(2-hydroxy-3-isopropylamino-propyl)...)
Affinity DataKi:  7.20E+3nM. Assay description: Binding afinity against beta2-adrenergic receptor in bovine lung
In DepthDetails ArticlePubMed
TargetBeta-1 adrenergic receptor(GUINEA PIG)
Universitá
Curated by ChEMBL
LigandPNGBDBM50036843(Acetaldehyde O-(2-hydroxy-3-isopropylamino-propyl)...)
Affinity DataIC50:  3.02E+4nM. Assay description: Inhibitory concentration against beta-1-adrenergic receptor in isolated guinea pig atria
In DepthDetails ArticlePubMed
TargetBeta-2 adrenergic receptor(GUINEA PIG)
Universitá
Curated by ChEMBL
LigandPNGBDBM50036843(Acetaldehyde O-(2-hydroxy-3-isopropylamino-propyl)...)
Affinity DataIC50:  1.29E+4nM. Assay description: Inhibitory concentration against beta-2-adrenergic receptor in isolated guinea pig tracheal strips
In DepthDetails ArticlePubMed