BDBM50036953 CHEMBL3355294
SMILES [#6]-[#8]-c1ccc(-[#6]-[#6](=O)-[#8]-[#6]\[#6]=[#6](\[#6])-[#6]-[#6]\[#6]=[#6](\[#6])-[#6])cc1
InChI Key InChIKey=CRQXDVJVYHHKFY-VBKFSLOCSA-N
Data  3 IC50  1 EC50
  Tab Delimited (TSV)   2D SDfile   Computed 3D by Vconf -m prep SDfile
Find this compound or compounds like it in BindingDB:
Activity Spreadsheet -- Enzyme Inhibition Constant Data from BindingDB
Found 4 hits for monomerid = 50036953
TargetTransient receptor potential cation channel subfamily V member 1(Homo sapiens (Human))
Sapienza University Of Rome
Curated by ChEMBL
LigandPNGBDBM50036953(CHEMBL3355294)
Affinity DataIC50: >1.00E+5nM. Assay description: Antagonist activity against human TRPV1 expressed in HEK293 cells assessed as inhibition of capsaicin-induced increase in intracellular Ca2+ concentr...
In DepthDetails ArticlePubMed
TargetTransient receptor potential cation channel subfamily M member 8(Rattus norvegicus (Rat))
Sapienza University Of Rome
Curated by ChEMBL
LigandPNGBDBM50036953(CHEMBL3355294)
Affinity DataIC50:  9.70E+3nM. Assay description: Antagonist activity against rat TRPM8 expressed in HEK293 cells assessed as inhibition of icilin-induced increase in intracellular Ca2+ concentration...
In DepthDetails ArticlePubMed
TargetTransient receptor potential cation channel subfamily A member 1(Rattus norvegicus)
Sapienza University Of Rome
Curated by ChEMBL
LigandPNGBDBM50036953(CHEMBL3355294)
Affinity DataIC50:  260nM. Assay description: Antagonist activity against rat TRPA1 expressed in HEK293 cells assessed as inhibition of AITC-induced increase in intracellular Ca2+ concentration b...
In DepthDetails ArticlePubMed
TargetTransient receptor potential cation channel subfamily A member 1(Rattus norvegicus)
Sapienza University Of Rome
Curated by ChEMBL
LigandPNGBDBM50036953(CHEMBL3355294)
Affinity DataEC50:  140nM. Assay description: Agonist activity at rat TRPA1 expressed in HEK293 cells assessed as increase in intracellular Ca2+ concentration by Fluo-4-AM dye based spectrofluori...
In DepthDetails ArticlePubMed