BDBM50037224 CHEMBL113692::N-[2-(6-Methoxy-benzoimidazol-1-yl)-ethyl]-acetamide
SMILES COc1ccc2ncn(CCNC(C)=O)c2c1
InChI Key InChIKey=GILSIDYMWWAJGM-UHFFFAOYSA-N
Data  2 IC50  1 Kd
  Tab Delimited (TSV)   2D SDfile   Computed 3D by Vconf -m prep SDfile
Find this compound or compounds like it in BindingDB:
Activity Spreadsheet -- Enzyme Inhibition Constant Data from BindingDB
Found 3 hits for monomerid = 50037224
TargetMelatonin receptor type 1A(Homo sapiens (Human))
Universit£
Curated by ChEMBL
LigandPNGBDBM50037224(CHEMBL113692 | N-[2-(6-Methoxy-benzoimidazol-1-yl)...)
Affinity DataIC50:  3.16E+3nM. Assay description: Melatonin receptor type 1A binding affinity measured using 2-[125I]iodomelatonin on ovine pars tuberalis membrane homogenates.
In DepthDetails ArticlePubMed
TargetMelatonin receptor type 1A/1B(Homo sapiens (Human))
Institut De Chimie Pharmaceutique
Curated by ChEMBL
LigandPNGBDBM50037224(CHEMBL113692 | N-[2-(6-Methoxy-benzoimidazol-1-yl)...)
Affinity DataKd:  1.70E+3nM. Assay description: Binding affinity to melatonin receptor measured on ovine pars tuberalis membrane
In DepthDetails ArticlePubMed
TargetMelatonin receptor type 1A/1B(Homo sapiens (Human))
Institut De Chimie Pharmaceutique
Curated by ChEMBL
LigandPNGBDBM50037224(CHEMBL113692 | N-[2-(6-Methoxy-benzoimidazol-1-yl)...)
Affinity DataIC50:  5.26E+3nM. Assay description: Monophasic inhibitory concentration against melatonin receptor was measured on ovine pars tuberalis membrane.
In DepthDetails ArticlePubMed