BDBM50037277 7-Dipropylamino-5,6,7,8-tetrahydro-1H-benzo[f]indole-3-carbaldehyde::CHEMBL113378
SMILES CCCN(CCC)C1CCc2cc3c(C=O)c[nH]c3cc2C1
InChI Key InChIKey=UQEPLPAEGWFYQH-UHFFFAOYSA-N
Data  2 KI
  Tab Delimited (TSV)   2D SDfile   Computed 3D by Vconf -m prep SDfile
Find this compound or compounds like it in BindingDB:
Activity Spreadsheet -- Enzyme Inhibition Constant Data from BindingDB
Found 2 hits for monomerid = 50037277
TargetD(2) dopamine receptor(Rattus norvegicus (rat))
GöTeborg University
Curated by ChEMBL
LigandPNGBDBM50037277(7-Dipropylamino-5,6,7,8-tetrahydro-1H-benzo[f]indo...)
Affinity DataKi:  700nM. Assay description: Displacement of the radioligand [3H]-spiperone from D2 receptor
In DepthDetails ArticlePubMed
Target5-hydroxytryptamine receptor 1A(Rattus norvegicus (rat))
GöTeborg University
Curated by ChEMBL
LigandPNGBDBM50037277(7-Dipropylamino-5,6,7,8-tetrahydro-1H-benzo[f]indo...)
Affinity DataKi:  4.72E+3nM. Assay description: Displacement of the radioligand [3H]-8-OH-DPAT from 5-hydroxytryptamine 1A receptor
In DepthDetails ArticlePubMed