BDBM50037556 CHEMBL3357201
SMILES CCC(CC)O[C@@H]1C=C(C[C@H](N)[C@H]1NC(C)=O)C(=O)NOC
InChI Key InChIKey=ZYHJMOZGMHULPA-BFHYXJOUSA-N
Data  1 IC50
  Tab Delimited (TSV)   2D SDfile   Computed 3D by Vconf -m prep SDfile
Find this compound or compounds like it in BindingDB:
Activity Spreadsheet -- Enzyme Inhibition Constant Data from BindingDB
Found 1 hit for monomerid = 50037556
TargetNeuraminidase(Influenza A virus (strain A/USSR/90/1977 H1N1))
TBA
Curated by ChEMBL
LigandPNGBDBM50037556(CHEMBL3357201)
Affinity DataIC50:  45nM. Assay description: Inhibition of Influenza A virus A/WSN/1933(H1N1) neuraminidase using 2-(4-methylumbelliferyl)-alpha-D-N-acetylneuraminic acid after 15 mins by fluore...
In DepthDetails ArticlePubMed