BDBM50037914 (4aR,6aR)-7-(1,5-Dimethyl-hexyl)-4a,6a-dimethyl-1,3,4,4a,4b,5,6,6a,7,8,9,9a,9b,10-tetradecahydro-indeno[5,4-f]quinolin-2-one::CHEMBL338707
SMILES CC(C)CCCC(C)C1CCC2C3CC=C4NC(=O)CC[C@]4(C)C3CC[C@]12C
InChI Key InChIKey=CUNINVBNANMBAN-XUVIWGRXSA-N
Data  1 IC50
  Tab Delimited (TSV)   2D SDfile   Computed 3D by Vconf -m prep SDfile
Find this compound or compounds like it in BindingDB:
Activity Spreadsheet -- Enzyme Inhibition Constant Data from BindingDB
Found 1 hit for monomerid = 50037914
Target3-oxo-5-alpha-steroid 4-dehydrogenase 1(Homo sapiens (Human))
Merck Research Laboratories
Curated by ChEMBL
LigandPNGBDBM50037914((4aR,6aR)-7-(1,5-Dimethyl-hexyl)-4a,6a-dimethyl-1,...)
Affinity DataIC50:  19nM. Assay description: Inhibition of type 1 steroid-5-alpha-reductase
In DepthDetails ArticlePubMed