BDBM50037917 (4aR,6aR,10R)-7-(1,5-Dimethyl-hexyl)-10-ethyl-1,4a,6a-trimethyl-1,3,4,4a,4b,5,6,6a,7,8,9,9a,9b,10-tetradecahydro-indeno[5,4-f]quinolin-2-one::CHEMBL125260
SMILES CC[C@H]1C=C2N(C)C(=O)CC[C@]2(C)C2CC[C@]3(C)C(CCC3C12)C(C)CCCC(C)C
InChI Key InChIKey=BFZBGOLMOZMRNW-KGNIKIJOSA-N
Data  2 IC50
  Tab Delimited (TSV)   2D SDfile   Computed 3D by Vconf -m prep SDfile
Find this compound or compounds like it in BindingDB:
Activity Spreadsheet -- Enzyme Inhibition Constant Data from BindingDB
Found 2 hits for monomerid = 50037917
Target3-oxo-5-alpha-steroid 4-dehydrogenase 1(Homo sapiens (Human))
Merck Research Laboratories
Curated by ChEMBL
LigandPNGBDBM50037917((4aR,6aR,10R)-7-(1,5-Dimethyl-hexyl)-10-ethyl-1,4a...)
Affinity DataIC50:  9.5nM. Assay description: Inhibition of type 1 steroid-5-alpha-reductase
In DepthDetails ArticlePubMed
Target3-oxo-5-alpha-steroid 4-dehydrogenase 2(Homo sapiens (Human))
Merck Research Laboratories
Curated by ChEMBL
LigandPNGBDBM50037917((4aR,6aR,10R)-7-(1,5-Dimethyl-hexyl)-10-ethyl-1,4a...)
Affinity DataIC50:  2.12E+3nM. Assay description: Inhibition of type 2 steroid-5-alpha-reductase
In DepthDetails ArticlePubMed