BDBM50037990 CHEMBL539815::{Butyl-[(S)-3-[((S)-1-carbamimidoyl-piperidin-3-ylmethyl)-carbamoyl]-2-(naphthalene-2-sulfonylamino)-propionyl]-amino}-acetic acid ethyl ester; hydrochloride
SMILES CCCCN(CC(=O)OCC)C(=O)[C@H](CC(=O)NC[C@@H]1CCCN(C1)C(N)=N)NS(=O)(=O)c1ccc2ccccc2c1
InChI Key InChIKey=FGEKTDPMDPPKAS-OFVILXPXSA-N
Data  2 KI
  Tab Delimited (TSV)   2D SDfile   Computed 3D by Vconf -m prep SDfile
Find this compound or compounds like it in BindingDB:
Activity Spreadsheet -- Enzyme Inhibition Constant Data from BindingDB
Found 2 hits for monomerid = 50037990
TargetProthrombin(Homo sapiens (Human))
F. Hoffmann-La Roche
Curated by ChEMBL
LigandPNGBDBM50037990(CHEMBL539815 | {Butyl-[(S)-3-[((S)-1-carbamimidoyl...)
Affinity DataKi:  330nM. Assay description: In vitro binding affinity by measuring the inhibition of human thrombin
In DepthDetails ArticlePubMed
TargetSerine protease 1(Bos taurus (bovine))
F. Hoffmann-La Roche
Curated by ChEMBL
LigandPNGBDBM50037990(CHEMBL539815 | {Butyl-[(S)-3-[((S)-1-carbamimidoyl...)
Affinity DataKi:  4.80E+4nM. Assay description: In vitro binding affinity by measuring the inhibition of bovine trypsin
In DepthDetails ArticlePubMed