BDBM50038308 CHEMBL3360518
SMILES OC(=O)Cc1ccc(Sc2ccc([N+]([O-])=O)c3nonc23)cc1
InChI Key InChIKey=CYMROBRKOJVEHN-UHFFFAOYSA-N
Data  2 IC50
  Tab Delimited (TSV)   2D SDfile   Computed 3D by Vconf -m prep SDfile
Find this compound or compounds like it in BindingDB:
Activity Spreadsheet -- Enzyme Inhibition Constant Data from BindingDB
Found 2 hits for monomerid = 50038308
TargetGlutathione S-transferase P(Homo sapiens (Human))
Sapienza University Of Rome
Curated by ChEMBL
LigandPNGBDBM50038308(CHEMBL3360518)
Affinity DataIC50:  400nM. Assay description: Inhibition of GSTP1-1 (unknown origin) using GSH substrate by spectrophotometric method
In DepthDetails ArticlePubMed
TargetGlutathione S-transferase Mu 2(Homo sapiens (Human))
Sapienza University Of Rome
Curated by ChEMBL
LigandPNGBDBM50038308(CHEMBL3360518)
Affinity DataIC50:  10nM. Assay description: Inhibition of GSTM2-2 (unknown origin) using GSH substrate by spectrophotometric method
In DepthDetails ArticlePubMed