BDBM50038329 CHEMBL3360530
SMILES COC(=O)C(CSc1ccc([N+]([O-])=O)c2nonc12)NC(=O)OCc1ccccc1
InChI Key InChIKey=GRYYOMJWZHIYKM-UHFFFAOYSA-N
Data  2 IC50
  Tab Delimited (TSV)   2D SDfile   Computed 3D by Vconf -m prep SDfile
Find this compound or compounds like it in BindingDB:
Activity Spreadsheet -- Enzyme Inhibition Constant Data from BindingDB
Found 2 hits for monomerid = 50038329
TargetGlutathione S-transferase P(Homo sapiens (Human))
Sapienza University Of Rome
Curated by ChEMBL
LigandPNGBDBM50038329(CHEMBL3360530)
Affinity DataIC50:  400nM. Assay description: Inhibition of GSTP1-1 (unknown origin) using GSH substrate by spectrophotometric method
In DepthDetails ArticlePubMed
TargetGlutathione S-transferase Mu 2(Homo sapiens (Human))
Sapienza University Of Rome
Curated by ChEMBL
LigandPNGBDBM50038329(CHEMBL3360530)
Affinity DataIC50:  8nM. Assay description: Inhibition of GSTM2-2 (unknown origin) using GSH substrate by spectrophotometric method
In DepthDetails ArticlePubMed