BDBM50038333 CHEMBL3360534
SMILES OCCCCSc1ccc([N+]([O-])=O)c2nonc12
InChI Key InChIKey=CUXNWDDDUWTHDH-UHFFFAOYSA-N
Data  2 IC50
  Tab Delimited (TSV)   2D SDfile   Computed 3D by Vconf -m prep SDfile
Find this compound or compounds like it in BindingDB:
Activity Spreadsheet -- Enzyme Inhibition Constant Data from BindingDB
Found 2 hits for monomerid = 50038333
TargetGlutathione S-transferase P(Homo sapiens (Human))
Sapienza University Of Rome
Curated by ChEMBL
LigandPNGBDBM50038333(CHEMBL3360534)
Affinity DataIC50:  1.40E+3nM. Assay description: Inhibition of GSTP1-1 (unknown origin) using GSH substrate by spectrophotometric method
In DepthDetails ArticlePubMed
TargetGlutathione S-transferase Mu 2(Homo sapiens (Human))
Sapienza University Of Rome
Curated by ChEMBL
LigandPNGBDBM50038333(CHEMBL3360534)
Affinity DataIC50:  30nM. Assay description: Inhibition of GSTM2-2 (unknown origin) using GSH substrate by spectrophotometric method
In DepthDetails ArticlePubMed