BDBM50038724 CHEMBL3354884
SMILES COc1cc2CCN(CCCCc3cn(-c4ccc(F)cc4)c4ccccc34)C(=O)c2cc1OC
InChI Key InChIKey=HSLRDKQVBMJYOG-UHFFFAOYSA-N
Data  1 KI
  Tab Delimited (TSV)   2D SDfile   Computed 3D by Vconf -m prep SDfile
Find this compound or compounds like it in BindingDB:
Activity Spreadsheet -- Enzyme Inhibition Constant Data from BindingDB
Found 1 hit for monomerid = 50038724
TargetSigma non-opioid intracellular receptor 1(Cavia porcellus (Guinea pig))
Universit£
Curated by ChEMBL
LigandPNGBDBM50038724(CHEMBL3354884)
Affinity DataKi: >5.00E+3nM. Assay description: Displacement of [3H]-(+)-pentazocine from guinea pig brain sigma1 receptor by scintillation counting analysis
In DepthDetails ArticlePubMed