BDBM50038981 Benzo[1,3]dioxol-5-ylmethyl-(7-chloro-quinazolin-4-yl)-amine::CHEMBL305771
SMILES Clc1ccc2c(NCc3ccc4OCOc4c3)ncnc2c1
InChI Key InChIKey=QKTINADOZXCJNN-UHFFFAOYSA-N
Data  1 IC50
  Tab Delimited (TSV)   2D SDfile   Computed 3D by Vconf -m prep SDfile
Find this compound or compounds like it in BindingDB:
Activity Spreadsheet -- Enzyme Inhibition Constant Data from BindingDB
Found 1 hit for monomerid = 50038981
TargetcGMP-specific 3',5'-cyclic phosphodiesterase(Homo sapiens (Human))
Eisai
Curated by ChEMBL
LigandPNGBDBM50038981(Benzo[1,3]dioxol-5-ylmethyl-(7-chloro-quinazolin-4...)
Affinity DataIC50:  1.10E+3nM. Assay description: Inhibitory activity against cGMP-phosphodiesterase from porcine aorta
In DepthDetails ArticlePubMed