BDBM50039126 CHEMBL3355373
SMILES COc1ccc2C(CCc2c1OC)NCCCCc1cn(-c2ccc(F)cc2)c2ccccc12
InChI Key InChIKey=XXHIDGAREGGPBO-UHFFFAOYSA-N
Data  1 KI  1 EC50
  Tab Delimited (TSV)   2D SDfile   Computed 3D by Vconf -m prep SDfile
Find this compound or compounds like it in BindingDB:
Activity Spreadsheet -- Enzyme Inhibition Constant Data from BindingDB
Found 2 hits for monomerid = 50039126
TargetSigma non-opioid intracellular receptor 1(Cavia porcellus (Guinea pig))
Universit£
Curated by ChEMBL
LigandPNGBDBM50039126(CHEMBL3355373)
Affinity DataKi:  215nM. Assay description: Displacement of (+)-[3H]-pentazocine from sigma1 recetor in guinea-pig brain membranes without cerebellum by radioligand binding assay
In DepthDetails ArticlePubMed
TargetATP-dependent translocase ABCB1(Homo sapiens (Human))
Universit£
Curated by ChEMBL
LigandPNGBDBM50039126(CHEMBL3355373)
Affinity DataEC50:  870nM. Assay description: Activity at MDR1 (unknown origin) expressed in MDCK-MDR1 cells by Calcein-AM assay
In DepthDetails ArticlePubMed