BDBM50039548 7-Benzyl-3,5-dihydro-pyrrolo[3,2-d]pyrimidin-4-one::CHEMBL81055
SMILES O=c1[nH]cnc2c(Cc3ccccc3)c[nH]c12
InChI Key InChIKey=XTZNEYRTGZTVGE-UHFFFAOYSA-N
Data  2 KI  2 IC50
  Tab Delimited (TSV)   2D SDfile   Computed 3D by Vconf -m prep SDfile
Find this compound or compounds like it in BindingDB:
Activity Spreadsheet -- Enzyme Inhibition Constant Data from BindingDB
Found 4 hits for monomerid = 50039548
TargetPurine nucleoside phosphorylase(Bos taurus (bovine))
University Of Michigan
Curated by ChEMBL
LigandPNGBDBM50039548(7-Benzyl-3,5-dihydro-pyrrolo[3,2-d]pyrimidin-4-one...)
Affinity DataKi:  5.40nM. Assay description: Inhibitory activity against calf spleen purine nucleoside phosphorylase (PNP) using 2-amino-6-mercapto-7-methyl purine ribonucleoside (MESG) as subst...
In DepthDetails ArticlePubMed
TargetPurine nucleoside phosphorylase(Bos taurus (bovine))
University Of Michigan
Curated by ChEMBL
LigandPNGBDBM50039548(7-Benzyl-3,5-dihydro-pyrrolo[3,2-d]pyrimidin-4-one...)
Affinity DataKi:  18.7nM. Assay description: Inhibitory activity against calf spleen purine nucleoside phosphorylase (PNP) using inosine as substrate at a concentration of 10 uM.
In DepthDetails ArticlePubMed
TargetPurine nucleoside phosphorylase(Rattus norvegicus)
Southern Research Institute
Curated by ChEMBL
LigandPNGBDBM50039548(7-Benzyl-3,5-dihydro-pyrrolo[3,2-d]pyrimidin-4-one...)
Affinity DataIC50:  35nM. Assay description: Tested for its ability to inhibit calf spleen purine nucleoside phosphorylase (PNP)
In DepthDetails ArticlePubMed
TargetPurine nucleoside phosphorylase(Bos taurus (bovine))
University Of Michigan
Curated by ChEMBL
LigandPNGBDBM50039548(7-Benzyl-3,5-dihydro-pyrrolo[3,2-d]pyrimidin-4-one...)
Affinity DataIC50:  24.5nM. Assay description: Inhibitory activity against calf spleen purine nucleoside phosphorylase (PNP) using inosine as substrate at a concentration of 10 uM.
In DepthDetails ArticlePubMed