BDBM50039558 7-(3-Benzyloxy-benzyl)-3,5-dihydro-pyrrolo[3,2-d]pyrimidin-4-one::CHEMBL84475
SMILES O=c1[nH]cnc2c(Cc3cccc(OCc4ccccc4)c3)c[nH]c12
InChI Key InChIKey=KPGUOANHRAPLEA-UHFFFAOYSA-N
Data  1 IC50
  Tab Delimited (TSV)   2D SDfile   Computed 3D by Vconf -m prep SDfile
Find this compound or compounds like it in BindingDB:
Activity Spreadsheet -- Enzyme Inhibition Constant Data from BindingDB
Found 1 hit for monomerid = 50039558
TargetPurine nucleoside phosphorylase(Rattus norvegicus)
Southern Research Institute
Curated by ChEMBL
LigandPNGBDBM50039558(7-(3-Benzyloxy-benzyl)-3,5-dihydro-pyrrolo[3,2-d]p...)
Affinity DataIC50:  190nM. Assay description: Tested for its ability to inhibit calf spleen purine nucleoside phosphorylase (PNP)
In DepthDetails ArticlePubMed