BDBM50039602 (2R,3R)-3-(2-bromo-1'H-spiro[indene-1,4'-piperidin]-1'-yl)-1,2,3,4-tetrahydronaphthalen-2-ol::CHEMBL406130
SMILES O[C@@H]1Cc2ccccc2C[C@H]1N1CCC2(CC1)C(Br)=Cc1ccccc21
InChI Key InChIKey=QAVMATCJPBGTSO-NHCUHLMSSA-N
Data  1 KI
  Tab Delimited (TSV)   2D SDfile   Computed 3D by Vconf -m prep SDfile
Find this compound or compounds like it in BindingDB:
Activity Spreadsheet -- Enzyme Inhibition Constant Data from BindingDB
Found 1 hit for monomerid = 50039602
TargetVesicular acetylcholine transporter(Torpedo californica)
University Of Minnesota
Curated by ChEMBL
LigandPNGBDBM50039602((2R,3R)-3-(2-bromo-1'H-spiro[indene-1,4'-piperidin...)
Affinity DataKi:  0.410nM. Assay description: In vitro binding affinity to vesamicol receptor using [3H]-vesamicol.
In DepthDetails ArticlePubMed