BDBM50039813 1-(2,3-Dihydro-benzo[1,4]dioxin-5-yl)-4-methyl-piperazine::CHEMBL27694
SMILES CN1CCN(CC1)c1cccc2OCCOc12
InChI Key InChIKey=RIHSPMCETPPJAN-UHFFFAOYSA-N
Data  4 KI
  Tab Delimited (TSV)   2D SDfile   Computed 3D by Vconf -m prep SDfile
Find this compound or compounds like it in BindingDB:
Activity Spreadsheet -- Enzyme Inhibition Constant Data from BindingDB
Found 4 hits for monomerid = 50039813
Target5-hydroxytryptamine receptor 1A(Rattus norvegicus (rat))
Universit£
Curated by ChEMBL
LigandPNGBDBM50039813(1-(2,3-Dihydro-benzo[1,4]dioxin-5-yl)-4-methyl-pip...)
Affinity DataKi:  23nM. Assay description: Binding affinity of a compound to rat brain 5-hydroxytryptamine 1A (serotonin) receptor assayed by radiolabeled [3H]-8-OH-DPAT ligand displacement
In DepthDetails ArticlePubMed
Target5-hydroxytryptamine receptor 1A(Rattus norvegicus (rat))
Universit£
Curated by ChEMBL
LigandPNGBDBM50039813(1-(2,3-Dihydro-benzo[1,4]dioxin-5-yl)-4-methyl-pip...)
Affinity DataKi:  24nM. Assay description: Binding affinity of a compound to rat brain 5-hydroxytryptamine 1A (serotonin) receptor assayed by radiolabeled [3H]-8-OH-DPAT ligand displacement
In DepthDetails ArticlePubMed
Target5-hydroxytryptamine receptor 1A(Rattus norvegicus (rat))
Universit£
Curated by ChEMBL
LigandPNGBDBM50039813(1-(2,3-Dihydro-benzo[1,4]dioxin-5-yl)-4-methyl-pip...)
Affinity DataKi:  24nM. Assay description: Displacement of radioligand [3H]-2-(di-N-propylamino)-8-hydroxytetralin from 5-hydroxytryptamine 1A receptor in rat frontal cortex homogenate
In DepthDetails ArticlePubMed
Target5-hydroxytryptamine receptor 1A(Rattus norvegicus (rat))
Universit£
Curated by ChEMBL
LigandPNGBDBM50039813(1-(2,3-Dihydro-benzo[1,4]dioxin-5-yl)-4-methyl-pip...)
Affinity DataKi:  24nM. Assay description: Binding affinity to displace [3H]2-(di-N-propylamino)-8-hydroxy-tetralin from 5-hydroxytryptamine 1A (5-HT1A) receptor in rat frontal cortex homogena...
In DepthDetails ArticlePubMed