BDBM50040042 CHEMBL3358874
SMILES Cc1cccc(C)c1C1CC(O)=C(Sc2ccccc2Cl)C(=O)O1
InChI Key InChIKey=DQVFBDGSVMHVRZ-UHFFFAOYSA-N
Data  1 IC50
  Tab Delimited (TSV)   2D SDfile   Computed 3D by Vconf -m prep SDfile
Find this compound or compounds like it in BindingDB:
Activity Spreadsheet -- Enzyme Inhibition Constant Data from BindingDB
Found 1 hit for monomerid = 50040042
TargetL-lactate dehydrogenase A chain(Homo sapiens (Human))
Genentech
Curated by ChEMBL
LigandPNGBDBM50040042(CHEMBL3358874)
Affinity DataIC50:  1.70E+4nM. Assay description: Inhibition of human LDH-A by biochemical assay
In DepthDetails ArticlePubMed