BDBM50040499 CHEMBL3361223
SMILES NC(=O)[C@H]1CC[C@H](CNc2nc(NCc3ccccc3)cc(n2)-c2cc3ccccc3o2)CC1
InChI Key InChIKey=LMBRNCPCPMAUCV-MXVIHJGJSA-N
Data  1 IC50
  Tab Delimited (TSV)   2D SDfile   Computed 3D by Vconf -m prep SDfile
Find this compound or compounds like it in BindingDB:
Activity Spreadsheet -- Enzyme Inhibition Constant Data from BindingDB
Found 1 hit for monomerid = 50040499
TargetTransitional endoplasmic reticulum ATPase(Homo sapiens (Human))
Nerviano Medical Sciences
Curated by ChEMBL
LigandPNGBDBM50040499(CHEMBL3361223)
Affinity DataIC50:  61nM. Assay description: Inhibition of human full length VCP (2 to 806 residues) expressed in High5 insect cells assessed as reduction in ATPase activity by measuring ADP for...
In DepthDetails ArticlePubMed