BDBM50040545 CHEMBL3361190
SMILES CS(=O)(=O)NC(=O)[C@H]1CC[C@H](CNc2nc(NCc3ccccc3)cc(n2)-c2ccccc2)CC1
InChI Key InChIKey=GPMXVZNIDVKQNM-AQYVVDRMSA-N
Data  1 IC50
  Tab Delimited (TSV)   2D SDfile   Computed 3D by Vconf -m prep SDfile
Find this compound or compounds like it in BindingDB:
Activity Spreadsheet -- Enzyme Inhibition Constant Data from BindingDB
Found 1 hit for monomerid = 50040545
TargetTransitional endoplasmic reticulum ATPase(Homo sapiens (Human))
Nerviano Medical Sciences
Curated by ChEMBL
LigandPNGBDBM50040545(CHEMBL3361190)
Affinity DataIC50:  133nM. Assay description: Inhibition of human full length VCP (2 to 806 residues) expressed in High5 insect cells assessed as reduction in ATPase activity by measuring ADP for...
In DepthDetails ArticlePubMed