BDBM50040674 1-((S)-1-Isobutyl-2-oxo-5-phenyl-2,3-dihydro-1H-benzo[e][1,4]diazepin-3-yl)-3-[4-(1H-tetrazol-5-yl)-phenyl]-urea::CHEMBL349730
SMILES CC(C)CN1c2ccccc2C(=N[C@H](NC(=O)Nc2ccc(cc2)-c2nnn[nH]2)C1=O)c1ccccc1
InChI Key InChIKey=GNIGUBCZEVSNOM-RUZDIDTESA-N
Data  2 IC50
  Tab Delimited (TSV)   2D SDfile   Computed 3D by Vconf -m prep SDfile
Find this compound or compounds like it in BindingDB:
Activity Spreadsheet -- Enzyme Inhibition Constant Data from BindingDB
Found 2 hits for monomerid = 50040674
TargetGastrin/cholecystokinin type B receptor(Homo sapiens (Human))
Merck Research Laboratories
Curated by ChEMBL
LigandPNGBDBM50040674(1-((S)-1-Isobutyl-2-oxo-5-phenyl-2,3-dihydro-1H-be...)
Affinity DataIC50:  0.142nM. Assay description: The compound was tested for binding activity against Cholecystokinin type B receptor from rat pancreatic tissue using [125]BH CCK-8 as radioligand
In DepthDetails ArticlePubMed
TargetCholecystokinin receptor type A(RAT)
Merck Research Laboratories
Curated by ChEMBL
LigandPNGBDBM50040674(1-((S)-1-Isobutyl-2-oxo-5-phenyl-2,3-dihydro-1H-be...)
Affinity DataIC50:  1.43E+3nM. Assay description: The compound was tested for binding activity against Cholecystokinin type A receptor from rat pancreatic tissue using [125]BH CCK-A as radioligand
In DepthDetails ArticlePubMed