BDBM50041039 CHEMBL307193::{1-[(1S,3S)-1-Benzyl-3-(2-benzyloxycarbonylamino-3-methyl-butyrylamino)-2-hydroxy-4-phenyl-butylcarbamoyl]-2-methyl-propyl}-carbamic acid benzyl ester
SMILES CC(C)[C@H](NC(=O)OCc1ccccc1)C(=O)N[C@@H](Cc1ccccc1)C(O)[C@H](Cc1ccccc1)NC(=O)[C@@H](NC(=O)OCc1ccccc1)C(C)C
InChI Key InChIKey=GEANBHANAKKWSL-ZQWQDMLBSA-N
Data  1 IC50
PDB links: 1 PDB ID matches this monomer.
  Tab Delimited (TSV)   2D SDfile   Computed 3D by Vconf -m prep SDfile
Find this compound or compounds like it in BindingDB:
Activity Spreadsheet -- Enzyme Inhibition Constant Data from BindingDB
Found 1 hit for monomerid = 50041039
TargetGag-Pol polyprotein [489-587](Human immunodeficiency virus type 1)
Abbott Laboratories
Curated by ChEMBL
LigandPNGBDBM50041039(CHEMBL307193 | {1-[(1S,3S)-1-Benzyl-3-(2-benzyloxy...)
Affinity DataIC50:  3nM. Assay description: Inhibition of HIV-1 protease