BDBM50041164 3-[1-(4-Chloro-benzyl)-4-methyl-6-(5-phenyl-pyridin-2-ylmethoxy)-4,5-dihydro-1H-thiopyrano[2,3,4-cd]indol-2-ylmethoxy]-propionic acid::CHEMBL278478
SMILES CC1Cc2c(OCc3ccc(cn3)-c3ccccc3)ccc3n(Cc4ccc(Cl)cc4)c(COCCC(O)=O)c(S1)c23
InChI Key InChIKey=KDRQFLWYPGUXGP-UHFFFAOYSA-N
Data  1 IC50
  Tab Delimited (TSV)   2D SDfile   Computed 3D by Vconf -m prep SDfile
Find this compound or compounds like it in BindingDB:
Activity Spreadsheet -- Enzyme Inhibition Constant Data from BindingDB
Found 1 hit for monomerid = 50041164
TargetPolyunsaturated fatty acid 5-lipoxygenase(Homo sapiens (Human))
Merck Frosst Centre For Therapeutic Research
Curated by ChEMBL
LigandPNGBDBM50041164(3-[1-(4-Chloro-benzyl)-4-methyl-6-(5-phenyl-pyridi...)
Affinity DataIC50:  250nM. Assay description: In vitro inhibition of human 5-Lipoxygenase.
In DepthDetails ArticlePubMed